Reaction Details
TargetTyrosine-protein kinase JAK2
LigandBDBM50303054
Substrate/Competitorn/a
Meas. Tech.ChEMBL_597274 (CHEMBL1043451)
IC50<3±n/a nM
Citation Ioannidis, SLamb, MLDavies, AMAlmeida, LSu, MBebernitz, GYe, MBell, KAlimzhanov, MZinda, M Discovery of pyrazol-3-ylamino pyrazines as novel JAK2 inhibitors. Bioorg Med Chem Lett19:6524-8 (2009) 
 
Tyrosine-protein kinase JAK2
Name:Tyrosine-protein kinase JAK2
Type:Protein
Mol. Mass.:130684.68
Organism:Homo sapiens (Human)
Description:O60674
Residue:1132
BDBM50303054
NameBDBM50303054
Synonyms:(S)-N2-(1-(5-fluoropyrimidin-2-yl)ethyl)-N6-(5-methyl-1H-pyrazol-3-yl)pyrazine-2,6-diamine | CHEMBL570899
TypeSmall organic molecule
Emp. Form.C14H15FN8
Mol. Mass.314.3209
SMILESC[C@H](Nc1cncc(Nc2cc(C)n[nH]2)n1)c1ncc(F)cn1