Reaction Details
TargetPhosphatidylinositol 4,5-bisphosphate 3-kinase catalytic subunit alpha isoform
LigandBDBM50303299
Substrate/Competitorn/a
Meas. Tech.ChEMBL_595397 (CHEMBL1039196)
IC50 68±n/a nM
Citation Richard, DJVerheijen, JCCurran, KKaplan, JToral-Barza, LHollander, ILucas, JYu, KZask, A Incorporation of water-solubilizing groups in pyrazolopyrimidine mTOR inhibitors: discovery of highly potent and selective analogs with improved human microsomal stability. Bioorg Med Chem Lett19:6830-5 (2009) 
 
Phosphatidylinositol 4,5-bisphosphate 3-kinase catalytic subunit alpha isoform
Name:Phosphatidylinositol 4,5-bisphosphate 3-kinase catalytic subunit alpha isoform
Type:Enzyme Subunit
Mol. Mass.:124294.87
Organism:Homo sapiens (Human)
Description:P42336
Residue:1068
BDBM50303299
NameBDBM50303299
Synonyms:1-(4-(4-(8-oxa-3-azabicyclo[3.2.1]octan-3-yl)-1-ethyl-1H-pyrazolo[3,4-d]pyrimidin-6-yl)phenyl)-3-(4-(2-hydroxyethyl)phenyl)urea | CHEMBL585480
TypeSmall organic molecule
Emp. Form.C28H31N7O3
Mol. Mass.513.5908
SMILESCCn1ncc2c(nc(nc12)-c1ccc(NC(=O)Nc2ccc(CCO)cc2)cc1)N1CC2CCC(C1)O2