Reaction Details
Target3-dehydroquinate dehydratase
LigandBDBM50303445
Substrate/Competitorn/a
Meas. Tech.ChEMBL_595938 (CHEMBL1041787)
Ki 132±n/a nM
Citation Prazeres, VFTizón, LOtero, JMGuardado-Calvo, PLlamas-Saiz, ALvan Raaij, MJCastedo, LLamb, HHawkins, ARGonzález-Bello, C Synthesis and biological evaluation of new nanomolar competitive inhibitors of Helicobacter pylori type II dehydroquinase. Structural details of the role of the aromatic moieties with essential residues. J Med Chem53:191-200 (2010) 
 
3-dehydroquinate dehydratase
Name:3-dehydroquinate dehydratase
Type:PROTEIN
Mol. Mass.:18479.08
Organism:Helicobacter pylori
Description:ChEMBL_766424
Residue:167
BDBM50303445
NameBDBM50303445
Synonyms:CHEMBL567563 | Sodium(1R,4S,5R)-1,4,5-Trihydroxy-3-(benzo[b]thiophen-2-yl)methoxycyclohexan-1-carboxylate
TypeSmall organic molecule
Emp. Form.C16H15O6S
Mol. Mass.335.352
SMILESO[C@@H]1C[C@@](O)(C=C(OCc2cc3ccccc3s2)[C@H]1O)C([O-])=O