Reaction Details
TargetDelta-type opioid receptor
LigandBDBM50303601
Substrate/Competitorn/a
Meas. Tech.ChEMBL_596275 (CHEMBL1050691)
Ki 300±n/a nM
Citation Decker, MSi, YGKnapp, BIBidlack, JMNeumeyer, JL Synthesis and opioid receptor binding affinities of 2-substituted and 3-aminomorphinans: ligands for mu, kappa, and delta opioid receptors. J Med Chem53:402-18 (2010) 
 
Delta-type opioid receptor
Name:Delta-type opioid receptor
Type:G Protein-Coupled Receptor (GPCR)
Mol. Mass.:40382.98
Organism:Homo sapiens (Human)
Description:Competition binding assays were carried out using membrane preparations from transfected HN9.10 cells that constitutively expressed the delta opioid receptor.
Residue:372
BDBM50303601
NameBDBM50303601
Synonyms:CHEMBL569724 | N-(4-Iodophenyl)-N'-(17-methylmorphinan-3-yl)urea
TypeSmall organic molecule
Emp. Form.C24H28IN3O
Mol. Mass.501.4031
SMILESCN1CC[C@]23CCCC[C@H]2[C@H]1Cc1ccc(NC(=O)Nc2ccc(I)cc2)cc31