Reaction Details
TargetDelta-type opioid receptor
LigandBDBM50303633
Substrate/Competitorn/a
Meas. Tech.ChEMBL_596275 (CHEMBL1050691)
Ki 39±n/a nM
Citation Decker, MSi, YGKnapp, BIBidlack, JMNeumeyer, JL Synthesis and opioid receptor binding affinities of 2-substituted and 3-aminomorphinans: ligands for mu, kappa, and delta opioid receptors. J Med Chem53:402-18 (2010) 
 
Delta-type opioid receptor
Name:Delta-type opioid receptor
Type:G Protein-Coupled Receptor (GPCR)
Mol. Mass.:40382.98
Organism:Homo sapiens (Human)
Description:Competition binding assays were carried out using membrane preparations from transfected HN9.10 cells that constitutively expressed the delta opioid receptor.
Residue:372
BDBM50303633
NameBDBM50303633
Synonyms:17-(Cyclobutylmethyl)-N-phenylmorphinan-3-amine | CHEMBL570225
TypeSmall organic molecule
Emp. Form.C27H34N2
Mol. Mass.386.5723
SMILESC(C1CCC1)N1CC[C@]23CCCC[C@H]2[C@H]1Cc1ccc(Nc2ccccc2)cc31