Reaction Details
TargetDelta-type opioid receptor
LigandBDBM50303607
Substrate/Competitorn/a
Meas. Tech.ChEMBL_596275 (CHEMBL1050691)
Ki>10000±n/a nM
Citation Decker, MSi, YGKnapp, BIBidlack, JMNeumeyer, JL Synthesis and opioid receptor binding affinities of 2-substituted and 3-aminomorphinans: ligands for mu, kappa, and delta opioid receptors. J Med Chem53:402-18 (2010) 
 
Delta-type opioid receptor
Name:Delta-type opioid receptor
Type:G Protein-Coupled Receptor (GPCR)
Mol. Mass.:40382.98
Organism:Homo sapiens (Human)
Description:Competition binding assays were carried out using membrane preparations from transfected HN9.10 cells that constitutively expressed the delta opioid receptor.
Residue:372
BDBM50303607
NameBDBM50303607
Synonyms:3-Benzyl-3,4-dihydro-2H-benzo[e][1,3]oxazinemorphinan | CHEMBL576065
TypeSmall organic molecule
Emp. Form.C26H32N2O
Mol. Mass.388.5451
SMILESCN1CC[C@]23CCCC[C@H]2[C@H]1Cc1cc2CN(Cc4ccccc4)COc2cc31