Reaction Details
TargetMu-type opioid receptor
LigandBDBM50303620
Substrate/Competitorn/a
Meas. Tech.ChEMBL_596273 (CHEMBL1050689)
Ki 36±n/a nM
Citation Decker, MSi, YGKnapp, BIBidlack, JMNeumeyer, JL Synthesis and opioid receptor binding affinities of 2-substituted and 3-aminomorphinans: ligands for mu, kappa, and delta opioid receptors. J Med Chem53:402-18 (2010) 
 
Mu-type opioid receptor
Name:Mu-type opioid receptor
Type:G Protein-Coupled Receptor (GPCR)
Mol. Mass.:44789.51
Organism:Homo sapiens (Human)
Description:P35372
Residue:400
BDBM50303620
NameBDBM50303620
Synonyms:(rac)-2-(1-Hydroxyundecyl)-3-hydroxy-17-N-cyclobutylmethylmorphinan | CHEMBL570428
TypeSmall organic molecule
Emp. Form.C31H49NO2
Mol. Mass.467.7263
SMILESCCCCCCCCCC(O)c1cc2C[C@@H]3[C@@H]4CCCC[C@]4(CCN3CC3CCC3)c2cc1O