Reaction Details
TargetMu-type opioid receptor
LigandBDBM50303622
Substrate/Competitorn/a
Meas. Tech.ChEMBL_596273 (CHEMBL1050689)
Ki 36±n/a nM
Citation Decker, MSi, YGKnapp, BIBidlack, JMNeumeyer, JL Synthesis and opioid receptor binding affinities of 2-substituted and 3-aminomorphinans: ligands for mu, kappa, and delta opioid receptors. J Med Chem53:402-18 (2010) 
 
Mu-type opioid receptor
Name:Mu-type opioid receptor
Type:G Protein-Coupled Receptor (GPCR)
Mol. Mass.:44789.51
Organism:Homo sapiens (Human)
Description:P35372
Residue:400
BDBM50303622
NameBDBM50303622
Synonyms:CHEMBL569009 | Hexanedioic Acid Bis(17-N-cyclobutylmethyl-3-hydroxymorphinan-2-methyl)amide
TypeSmall organic molecule
Emp. Form.C50H70N4O4
Mol. Mass.791.1152
SMILESOc1cc2c(C[C@@H]3[C@@H]4CCCC[C@]24CCN3CC2CCC2)cc1CNC(=O)CCCCC(=O)NCc1cc2C[C@@H]3[C@@H]4CCCC[C@]4(CCN3CC3CCC3)c2cc1O