Reaction Details
TargetKappa-type opioid receptor
LigandBDBM50303624
Substrate/Competitorn/a
Meas. Tech.ChEMBL_596274 (CHEMBL1050690)
Ki 5.8±n/a nM
Citation Decker, MSi, YGKnapp, BIBidlack, JMNeumeyer, JL Synthesis and opioid receptor binding affinities of 2-substituted and 3-aminomorphinans: ligands for mu, kappa, and delta opioid receptors. J Med Chem53:402-18 (2010) 
 
Kappa-type opioid receptor
Name:Kappa-type opioid receptor
Type:G Protein-Coupled Receptor (GPCR)
Mol. Mass.:42648.76
Organism:Homo sapiens (Human)
Description:P41145
Residue:380
BDBM50303624
NameBDBM50303624
Synonyms:(1R,9R,10R)-17-(cyclobutylmethyl)-N-[(4-iodophenyl)methyl]-17-azatetracyclo[7.5.3.0^{1,10}.0^{2,7}]heptadeca-2(7),3,5-trien-4-amine | CHEMBL576273
TypeSmall organic molecule
Emp. Form.C28H35IN2
Mol. Mass.526.4954
SMILESIc1ccc(CNc2ccc3C[C@@H]4[C@@H]5CCCC[C@]5(CCN4CC4CCC4)c3c2)cc1