Reaction Details
TargetKappa-type opioid receptor
LigandBDBM50303626
Substrate/Competitorn/a
Meas. Tech.ChEMBL_596274 (CHEMBL1050690)
Ki 3.9±n/a nM
Citation Decker, MSi, YGKnapp, BIBidlack, JMNeumeyer, JL Synthesis and opioid receptor binding affinities of 2-substituted and 3-aminomorphinans: ligands for mu, kappa, and delta opioid receptors. J Med Chem53:402-18 (2010) 
 
Kappa-type opioid receptor
Name:Kappa-type opioid receptor
Type:G Protein-Coupled Receptor (GPCR)
Mol. Mass.:42648.76
Organism:Homo sapiens (Human)
Description:P41145
Residue:380
BDBM50303626
NameBDBM50303626
Synonyms:17-(Cyclopropylmethyl)-N,N-bis(4-methoxybenzyl)morphinan-3-amine | CHEMBL568988
TypeSmall organic molecule
Emp. Form.C36H44N2O2
Mol. Mass.536.7468
SMILESCOc1ccc(CN(Cc2ccc(OC)cc2)c2ccc3C[C@@H]4[C@@H]5CCCC[C@]5(CCN4CC4CC4)c3c2)cc1