Reaction Details
TargetKappa-type opioid receptor
LigandBDBM50303634
Substrate/Competitorn/a
Meas. Tech.ChEMBL_596274 (CHEMBL1050690)
Ki 5.2±n/a nM
Citation Decker, MSi, YGKnapp, BIBidlack, JMNeumeyer, JL Synthesis and opioid receptor binding affinities of 2-substituted and 3-aminomorphinans: ligands for mu, kappa, and delta opioid receptors. J Med Chem53:402-18 (2010) 
 
Kappa-type opioid receptor
Name:Kappa-type opioid receptor
Type:G Protein-Coupled Receptor (GPCR)
Mol. Mass.:42648.76
Organism:Homo sapiens (Human)
Description:P41145
Residue:380
BDBM50303634
NameBDBM50303634
Synonyms:17-Methylmorphinan-3-yl 4-Iodophenyl Carbamate | CHEMBL568989
TypeSmall organic molecule
Emp. Form.C24H27IN2O2
Mol. Mass.502.3879
SMILESCN1CC[C@]23CCCC[C@H]2[C@H]1Cc1ccc(OC(=O)Nc2ccc(I)cc2)cc31