Reaction Details
TargetKappa-type opioid receptor
LigandBDBM50303605
Substrate/Competitorn/a
Meas. Tech.ChEMBL_596274 (CHEMBL1050690)
Ki 86±n/a nM
Citation Decker, MSi, YGKnapp, BIBidlack, JMNeumeyer, JL Synthesis and opioid receptor binding affinities of 2-substituted and 3-aminomorphinans: ligands for mu, kappa, and delta opioid receptors. J Med Chem53:402-18 (2010) 
 
Kappa-type opioid receptor
Name:Kappa-type opioid receptor
Type:G Protein-Coupled Receptor (GPCR)
Mol. Mass.:42648.76
Organism:Homo sapiens (Human)
Description:P41145
Residue:380
BDBM50303605
NameBDBM50303605
Synonyms:2-Hydroxymethyl-3-hydroxy-17-N-cyclobutylmethylmorphinan | CHEMBL568878
TypeSmall organic molecule
Emp. Form.C22H31NO2
Mol. Mass.341.487
SMILESOCc1cc2C[C@@H]3[C@@H]4CCCC[C@]4(CCN3CC3CCC3)c2cc1O