Reaction Details
TargetMu-type opioid receptor
LigandBDBM50303623
Substrate/Competitorn/a
Meas. Tech.ChEMBL_596273 (CHEMBL1050689)
Ki 0.710000±n/a nM
Citation Decker, MSi, YGKnapp, BIBidlack, JMNeumeyer, JL Synthesis and opioid receptor binding affinities of 2-substituted and 3-aminomorphinans: ligands for mu, kappa, and delta opioid receptors. J Med Chem53:402-18 (2010) 
 
Mu-type opioid receptor
Name:Mu-type opioid receptor
Type:G Protein-Coupled Receptor (GPCR)
Mol. Mass.:44789.51
Organism:Homo sapiens (Human)
Description:P35372
Residue:400
BDBM50303623
NameBDBM50303623
Synonyms:17-(Cyclopropylmethyl)-N-(4-iodobenzyl)morphinan-3-amine | CHEMBL568876
TypeSmall organic molecule
Emp. Form.C27H33IN2
Mol. Mass.512.4688
SMILESIc1ccc(CNc2ccc3C[C@@H]4[C@@H]5CCCC[C@]5(CCN4CC4CC4)c3c2)cc1