Reaction Details
TargetMu-type opioid receptor
LigandBDBM50303604
Substrate/Competitorn/a
Meas. Tech.ChEMBL_596273 (CHEMBL1050689)
Ki 15±n/a nM
Citation Decker, MSi, YGKnapp, BIBidlack, JMNeumeyer, JL Synthesis and opioid receptor binding affinities of 2-substituted and 3-aminomorphinans: ligands for mu, kappa, and delta opioid receptors. J Med Chem53:402-18 (2010) 
 
Mu-type opioid receptor
Name:Mu-type opioid receptor
Type:G Protein-Coupled Receptor (GPCR)
Mol. Mass.:44789.51
Organism:Homo sapiens (Human)
Description:P35372
Residue:400
BDBM50303604
NameBDBM50303604
Synonyms:2-Hydroxymethyl-3-hydroxymorphinan | CHEMBL570449
TypeSmall organic molecule
Emp. Form.C18H25NO2
Mol. Mass.287.3966
SMILESCN1CC[C@]23CCCC[C@H]2[C@H]1Cc1cc(CO)c(O)cc31