Reaction Details
TargetMu-type opioid receptor
LigandBDBM50303607
Substrate/Competitorn/a
Meas. Tech.ChEMBL_596273 (CHEMBL1050689)
Ki 110±n/a nM
Citation Decker, MSi, YGKnapp, BIBidlack, JMNeumeyer, JL Synthesis and opioid receptor binding affinities of 2-substituted and 3-aminomorphinans: ligands for mu, kappa, and delta opioid receptors. J Med Chem53:402-18 (2010) 
 
Mu-type opioid receptor
Name:Mu-type opioid receptor
Type:G Protein-Coupled Receptor (GPCR)
Mol. Mass.:44789.51
Organism:Homo sapiens (Human)
Description:P35372
Residue:400
BDBM50303607
NameBDBM50303607
Synonyms:3-Benzyl-3,4-dihydro-2H-benzo[e][1,3]oxazinemorphinan | CHEMBL576065
TypeSmall organic molecule
Emp. Form.C26H32N2O
Mol. Mass.388.5451
SMILESCN1CC[C@]23CCCC[C@H]2[C@H]1Cc1cc2CN(Cc4ccccc4)COc2cc31