Reaction Details
TargetMu-type opioid receptor
LigandBDBM50303610
Substrate/Competitorn/a
Meas. Tech.ChEMBL_596273 (CHEMBL1050689)
Ki 330±n/a nM
Citation Decker, MSi, YGKnapp, BIBidlack, JMNeumeyer, JL Synthesis and opioid receptor binding affinities of 2-substituted and 3-aminomorphinans: ligands for mu, kappa, and delta opioid receptors. J Med Chem53:402-18 (2010) 
 
Mu-type opioid receptor
Name:Mu-type opioid receptor
Type:G Protein-Coupled Receptor (GPCR)
Mol. Mass.:44789.51
Organism:Homo sapiens (Human)
Description:P35372
Residue:400
BDBM50303610
NameBDBM50303610
Synonyms:2-(N-n-Propyl)aminomethyl-3-hydroxy-17-N-cyclobutylmethylmorphinan | CHEMBL583265
TypeSmall organic molecule
Emp. Form.C25H38N2O
Mol. Mass.382.582
SMILESCCCNCc1cc2C[C@@H]3[C@@H]4CCCC[C@]4(CCN3CC3CCC3)c2cc1O