Reaction Details
TargetCannabinoid receptor 1
LigandBDBM50303836
Substrate/Competitorn/a
Meas. Tech.ChEMBL_594777 (CHEMBL1040738)
Ki 19±n/a nM
Citation Lange, JHCoolen, HKvan der Neut, MABorst, AJStork, BVerveer, PCKruse, CG Design, synthesis, biological properties, and molecular modeling investigations of novel tacrine derivatives with a combination of acetylcholinesterase inhibition and cannabinoid CB1 receptor antagonism. J Med Chem53:1338-46 (2010) 
 
Cannabinoid receptor 1
Name:Cannabinoid receptor 1
Type:G Protein-Coupled Receptor (GPCR)
Mol. Mass.:52868.96
Organism:Homo sapiens (Human)
Description:P21554
Residue:472
BDBM50303836
NameBDBM50303836
Synonyms:3-(4-Chlorophenyl)-N'-((4-chlorophenyl)sulfonyl)-N-[4-(methyl)-piperidin-4-yl]-4-phenyl-4,5-dihydro-1H-pyrazole-1-carboxamidine | CHEMBL566388
TypeSmall organic molecule
Emp. Form.C28H29Cl2N5O2S
Mol. Mass.570.533
SMILESCN1CCC(CC1)N=C(NS(=O)(=O)c1ccc(Cl)cc1)N1CC(C(=N1)c1ccc(Cl)cc1)c1ccccc1