Reaction Details
TargetCannabinoid receptor 2
LigandBDBM29094
Substrate/Competitorn/a
Meas. Tech.ChEMBL_594921 (CHEMBL1041654)
Ki>1000±n/a nM
Citation Lange, JHCoolen, HKvan der Neut, MABorst, AJStork, BVerveer, PCKruse, CG Design, synthesis, biological properties, and molecular modeling investigations of novel tacrine derivatives with a combination of acetylcholinesterase inhibition and cannabinoid CB1 receptor antagonism. J Med Chem53:1338-46 (2010) 
 
Cannabinoid receptor 2
Name:Cannabinoid receptor 2
Type:G Protein-Coupled Receptor (GPCR)
Mol. Mass.:39690.94
Organism:Homo sapiens (Human)
Description:P34972
Residue:360
BDBM29094
NameBDBM29094
Synonyms:(+/-)-SLV319 3-(4-chlorophenyl)-N''''-(4-chlorophenylsulfonyl)-N-methyl-4-phenyl-4,5-dihydro-1H-pyrazole-1-carboximidamide CHEMBL158784 ibipinabant
TypeSmall organic molecule
Emp. Form.C23H20Cl2N4O2S
Mol. Mass.487.402
SMILESCN=C(NS(=O)(=O)c1ccc(Cl)cc1)N1CC(C(=N1)c1ccc(Cl)cc1)c1ccccc1