Reaction Details
TargetAmine oxidase [flavin-containing] A
LigandBDBM50304156
Substrate/Competitorn/a
Meas. Tech.ChEMBL_601025 (CHEMBL1069162)
IC50 780±n/a nM
Citation Gökhan-Kelekçi, NSimsek, OOErcan, AYelekçi, KSahin, ZSIsik, SUçar, GBilgin, AA Synthesis and molecular modeling of some novel hexahydroindazole derivatives as potent monoamine oxidase inhibitors. Bioorg Med Chem17:6761-72 (2009) 
 
Amine oxidase [flavin-containing] A
Name:Amine oxidase [flavin-containing] A
Type:Enzyme
Mol. Mass.:59515.21
Organism:Rattus norvegicus (rat)
Description:n/a
Residue:526
BDBM50304156
NameBDBM50304156
Synonyms:3-(2-Furyl)-2-(N-phenyllthiocarbamoyl)-3,3a,4,5,6,7-hexahydro-2H-indazol | CHEMBL594029
TypeSmall organic molecule
Emp. Form.C18H19N3OS
Mol. Mass.325.428
SMILESS=C(Nc1ccccc1)N1N=C2CCCCC2C1c1ccco1