Reaction Details
TargetAurora kinase B
LigandBDBM50304214
Substrate/Competitorn/a
Meas. Tech.ChEMBL_605383 (CHEMBL1073377)
IC50 90±n/a nM
Citation Tasler, SMüller, OWieber, THerz, TPegoraro, SSaeb, WLang, MKrauss, RTotzke, FZirrgiebel, UEhlert, JEKubbutat, MHSchächtele, C Substituted 2-arylbenzothiazoles as kinase inhibitors: hit-to-lead optimization. Bioorg Med Chem17:6728-37 (2009) 
 
Aurora kinase B
Name:Aurora kinase B
Type:Protein
Mol. Mass.:39327.72
Organism:Homo sapiens (Human)
Description:Q96GD4
Residue:344
BDBM50304214
NameBDBM50304214
Synonyms:CHEMBL593909 | N-(4-(6-chlorobenzo[d]thiazol-2-yl)-2-fluorophenyl)-6-methoxy-7-(3-(4-methylpiperazin-1-yl)propoxy)quinazolin-4-amine
TypeSmall organic molecule
Emp. Form.C30H30ClFN6O2S
Mol. Mass.593.115
SMILESCOc1cc2c(Nc3ccc(cc3F)-c3nc4ccc(Cl)cc4s3)ncnc2cc1OCCCN1CCN(C)CC1