Reaction Details
TargetAngiopoietin-1 receptor
LigandBDBM50304197
Substrate/Competitorn/a
Meas. Tech.ChEMBL_605386 (CHEMBL1073380)
IC50 9±n/a nM
Citation Tasler, SMüller, OWieber, THerz, TPegoraro, SSaeb, WLang, MKrauss, RTotzke, FZirrgiebel, UEhlert, JEKubbutat, MHSchächtele, C Substituted 2-arylbenzothiazoles as kinase inhibitors: hit-to-lead optimization. Bioorg Med Chem17:6728-37 (2009) 
 
Angiopoietin-1 receptor
Name:Angiopoietin-1 receptor
Type:Enzyme
Mol. Mass.:125835.70
Organism:Homo sapiens (Human)
Description:Q02763
Residue:1124
BDBM50304197
NameBDBM50304197
Synonyms:CHEMBL593987 | N-(4-(benzo[d]thiazol-2-yl)-3-fluorophenyl)-6-methoxy-7-(3-(4-methylpiperazin-1-yl)propoxy)quinazolin-4-amine
TypeSmall organic molecule
Emp. Form.C30H31FN6O2S
Mol. Mass.558.67
SMILESCOc1cc2c(Nc3ccc(-c4nc5ccccc5s4)c(F)c3)ncnc2cc1OCCCN1CCN(C)CC1