Reaction Details
TargetAurora kinase A
LigandBDBM50304193
Substrate/Competitorn/a
Meas. Tech.ChEMBL_605382 (CHEMBL1073376)
IC50 65±n/a nM
Citation Tasler, SMüller, OWieber, THerz, TPegoraro, SSaeb, WLang, MKrauss, RTotzke, FZirrgiebel, UEhlert, JEKubbutat, MHSchächtele, C Substituted 2-arylbenzothiazoles as kinase inhibitors: hit-to-lead optimization. Bioorg Med Chem17:6728-37 (2009) 
 
Aurora kinase A
Name:Aurora kinase A
Type:Serine/threonine-protein kinase
Mol. Mass.:45830.98
Organism:Homo sapiens (Human)
Description:O14965
Residue:403
BDBM50304193
NameBDBM50304193
Synonyms:CHEMBL593221 | N-[4-(Benzo[d]thiazol-2''-yl)-2-hydroxyphenyl]-6'-methoxy-7'-[3-(4-methylpiperazin-1-yl)propoxy]quinazolin-4'-amine
TypeSmall organic molecule
Emp. Form.C31H34N6O3S
Mol. Mass.570.705
SMILESCOc1cc(ccc1Nc1ncnc2cc(OCCCN3CCN(C)CC3)c(OC)cc12)-c1nc2ccccc2s1