Reaction Details
TargetAurora kinase A
LigandBDBM50304213
Substrate/Competitorn/a
Meas. Tech.ChEMBL_605382 (CHEMBL1073376)
IC50 54±n/a nM
Citation Tasler, SMüller, OWieber, THerz, TPegoraro, SSaeb, WLang, MKrauss, RTotzke, FZirrgiebel, UEhlert, JEKubbutat, MHSchächtele, C Substituted 2-arylbenzothiazoles as kinase inhibitors: hit-to-lead optimization. Bioorg Med Chem17:6728-37 (2009) 
 
Aurora kinase A
Name:Aurora kinase A
Type:Serine/threonine-protein kinase
Mol. Mass.:45830.98
Organism:Homo sapiens (Human)
Description:O14965
Residue:403
BDBM50304213
NameBDBM50304213
Synonyms:CHEMBL593275 | N-[4-(6''-Fluorobenzo[d]thiazol-2''-yl)phenyl]-6'-methoxy-7'-[3-(4-methylpiperazin-1-yl)propoxy]quinazolin-4'-amine
TypeSmall organic molecule
Emp. Form.C30H31ClN6O2S
Mol. Mass.575.124
SMILESCOc1cc2c(Nc3ccc(cc3)-c3nc4ccc(Cl)cc4s3)ncnc2cc1OCCCN1CCN(C)CC1