Reaction Details
TargetAurora kinase A
LigandBDBM50304201
Substrate/Competitorn/a
Meas. Tech.ChEMBL_605382 (CHEMBL1073376)
IC50 60±n/a nM
Citation Tasler, SMüller, OWieber, THerz, TPegoraro, SSaeb, WLang, MKrauss, RTotzke, FZirrgiebel, UEhlert, JEKubbutat, MHSchächtele, C Substituted 2-arylbenzothiazoles as kinase inhibitors: hit-to-lead optimization. Bioorg Med Chem17:6728-37 (2009) 
 
Aurora kinase A
Name:Aurora kinase A
Type:Serine/threonine-protein kinase
Mol. Mass.:45830.98
Organism:Homo sapiens (Human)
Description:O14965
Residue:403
BDBM50304201
NameBDBM50304201
Synonyms:CHEMBL593908 | N-[4-(5''-Chlorobenzo[d]thiazol-2''-yl)phenyl]-6'-methoxy-7'-[3-(4-methylpiperazin-1-yl)propoxy]quinazolin-4'-amine
TypeSmall organic molecule
Emp. Form.C31H31F3N6O2S
Mol. Mass.608.677
SMILESCOc1cc2c(Nc3ccc(cc3)-c3nc4cc(ccc4s3)C(F)(F)F)ncnc2cc1OCCCN1CCN(C)CC1