Reaction Details
TargetEpidermal growth factor receptor
LigandBDBM50304220
Substrate/Competitorn/a
Meas. Tech.ChEMBL_605384 (CHEMBL1073378)
IC50 15±n/a nM
Citation Tasler, SMüller, OWieber, THerz, TPegoraro, SSaeb, WLang, MKrauss, RTotzke, FZirrgiebel, UEhlert, JEKubbutat, MHSchächtele, C Substituted 2-arylbenzothiazoles as kinase inhibitors: hit-to-lead optimization. Bioorg Med Chem17:6728-37 (2009) 
 
Epidermal growth factor receptor
Name:Epidermal growth factor receptor
Type:Receptor Kinase Domain
Mol. Mass.:134279.59
Organism:Homo sapiens (Human)
Description:P00533
Residue:1210
BDBM50304220
NameBDBM50304220
Synonyms:CHEMBL593911 | N-[4-(Benzo[d]thiazol-2''-yl)-3-methoxyphenyl]-7'-methoxy-6'-[3-(4-methylpiperazin-1-yl)propoxy]quinazolin-4'-amine
TypeSmall organic molecule
Emp. Form.C31H34N6O3S
Mol. Mass.570.705
SMILESCOc1cc2ncnc(Nc3ccc(-c4nc5ccccc5s4)c(OC)c3)c2cc1OCCCN1CCN(C)CC1