Reaction Details
TargetSeed linoleate 13S-lipoxygenase-1
LigandBDBM50304296
Substrate/Competitorn/a
Meas. Tech.ChEMBL_606150 (CHEMBL1074616)
Ki 700±n/a nM
Citation Wecksler, ATGarcia, NKHolman, TR Substrate specificity effects of lipoxygenase products and inhibitors on soybean lipoxygenase-1. Bioorg Med Chem17:6534-9 (2009) 
 
Seed linoleate 13S-lipoxygenase-1
Name:Seed linoleate 13S-lipoxygenase-1
Type:Enzyme
Mol. Mass.:94365.66
Organism:Glycine max (soybean)
Description:n/a
Residue:839
BDBM50304296
NameBDBM50304296
Synonyms:CHEMBL594396 | Oleyl sulfate
TypeSmall organic molecule
Emp. Form.C18H36O4S
Mol. Mass.348.541
SMILESCCCCCCCC\C=C/CCCCCCCCOS(O)(=O)=O