Reaction Details
TargetGlycine receptor subunit alpha-1
LigandBDBM50415202
Substrate/Competitorn/a
Meas. Tech.ChEMBL_606507 (CHEMBL1065458)
IC50 128.82±n/a nM
Citation Maksay, GVincze, ZNemes, P Synthesis of heteroaromatic tropeines and heterogeneous binding to glycine receptors. Bioorg Med Chem17:6872-8 (2009) 
 
Glycine receptor subunit alpha-1
Name:Glycine receptor subunit alpha-1
Type:Enzyme Catalytic Domain
Mol. Mass.:52629.37
Organism:RAT
Description:Glycine, non-strychnine 0 RAT::P07727
Residue:457
BDBM50415202
NameBDBM50415202
Synonyms:CHEMBL611365
TypeSmall organic molecule
Emp. Form.C12H16N2O2
Mol. Mass.220.2676
SMILESO=C(OC1C[C@H]2CC[C@H](C1)N2)c1ccc[nH]1