Reaction Details
TargetGlycine receptor subunit alpha-1
LigandBDBM50415205
Substrate/Competitorn/a
Meas. Tech.ChEMBL_606507 (CHEMBL1065458)
IC50 5623.41±n/a nM
Citation Maksay, GVincze, ZNemes, P Synthesis of heteroaromatic tropeines and heterogeneous binding to glycine receptors. Bioorg Med Chem17:6872-8 (2009) 
 
Glycine receptor subunit alpha-1
Name:Glycine receptor subunit alpha-1
Type:Enzyme Catalytic Domain
Mol. Mass.:52629.37
Organism:RAT
Description:Glycine, non-strychnine 0 RAT::P07727
Residue:457
BDBM50415205
NameBDBM50415205
Synonyms:CHEMBL595797
TypeSmall organic molecule
Emp. Form.C13H17NO3
Mol. Mass.235.279
SMILESCN1[C@@H]2CC[C@@H]1CC(C2)OC(=O)c1ccco1