Reaction Details
TargetGlycine receptor subunit alpha-1
LigandBDBM50304334
Substrate/Competitorn/a
Meas. Tech.ChEMBL_606508 (CHEMBL1065459)
IC50 10.23±n/a nM
Citation Maksay, GVincze, ZNemes, P Synthesis of heteroaromatic tropeines and heterogeneous binding to glycine receptors. Bioorg Med Chem17:6872-8 (2009) 
 
Glycine receptor subunit alpha-1
Name:Glycine receptor subunit alpha-1
Type:Enzyme Catalytic Domain
Mol. Mass.:52629.37
Organism:RAT
Description:Glycine, non-strychnine 0 RAT::P07727
Residue:457
BDBM50304334
NameBDBM50304334
Synonyms:3alpha-(1'-Methyl-2'-Indolecarbonyloxy)-tropane | CHEMBL593963
TypeSmall organic molecule
Emp. Form.C18H22N2O2
Mol. Mass.298.3795
SMILESCN1[C@@H]2CC[C@@H]1CC(C2)OC(=O)c1cc2ccccc2n1C