Reaction Details
TargetGlycine receptor subunit alpha-1
LigandBDBM50415203
Substrate/Competitorn/a
Meas. Tech.ChEMBL_606509 (CHEMBL1065460)
IC50 4265.8±n/a nM
Citation Maksay, GVincze, ZNemes, P Synthesis of heteroaromatic tropeines and heterogeneous binding to glycine receptors. Bioorg Med Chem17:6872-8 (2009) 
 
Glycine receptor subunit alpha-1
Name:Glycine receptor subunit alpha-1
Type:Enzyme Catalytic Domain
Mol. Mass.:52629.37
Organism:RAT
Description:Glycine, non-strychnine 0 RAT::P07727
Residue:457
BDBM50415203
NameBDBM50415203
Synonyms:CHEMBL595116
TypeSmall organic molecule
Emp. Form.C13H17NO2S
Mol. Mass.251.345
SMILESCN1[C@@H]2CC[C@@H]1CC(C2)OC(=O)c1cccs1