Reaction Details
TargetHepatocyte nuclear factor 4-alpha
LigandBDBM50304342
Substrate/Competitorn/a
Meas. Tech.ChEMBL_606516 (CHEMBL1065467)
EC50>100000±n/a nM
Citation Le Guével, ROger, FLecorgne, ADudasova, ZChevance, SBondon, ABarath, PSimonneaux, GSalbert, G Identification of small molecule regulators of the nuclear receptor HNF4alpha based on naphthofuran scaffolds. Bioorg Med Chem17:7021-30 (2009) 
 
Hepatocyte nuclear factor 4-alpha
Name:Hepatocyte nuclear factor 4-alpha
Type:PROTEIN
Mol. Mass.:52790.24
Organism:Homo sapiens (Human)
Description:ChEMBL_606516
Residue:474
BDBM50304342
NameBDBM50304342
Synonyms:CHEMBL611816 | naphtho[2,1-b]furan-2-carboxamide
TypeSmall organic molecule
Emp. Form.C13H9NO2
Mol. Mass.211.2161
SMILESNC(=O)c1cc2c(ccc3ccccc23)o1