Reaction Details
TargetcAMP-specific 3',5'-cyclic phosphodiesterase 4D
LigandBDBM50304391
Substrate/Competitorn/a
Meas. Tech.ChEMBL_603142 (CHEMBL1041602)
IC50 85±n/a nM
Citation Kagayama, KMorimoto, TNagata, SKatoh, FZhang, XInoue, NHashino, AKageyama, KShikaura, JNiwa, T Synthesis and biological evaluation of novel phthalazinone derivatives as topically active phosphodiesterase 4 inhibitors. Bioorg Med Chem17:6959-70 (2009) 
 
cAMP-specific 3',5'-cyclic phosphodiesterase 4D
Name:cAMP-specific 3',5'-cyclic phosphodiesterase 4D
Type:Protein
Mol. Mass.:91092.69
Organism:Homo sapiens (Human)
Description:Q08499
Residue:809
BDBM50304391
NameBDBM50304391
Synonyms:(cis)-4-(3,4-dimethoxyphenyl)-4a,5,8,8a-tetrahydrophthalazin-1(2H)-one cis-(+/-)-4-(3,4-Dimethoxyphenyl)-4a,5,8,8a-tetrahydrophthalazin-1(2H)-one | cis-4-(3,4-Dimethoxyphenyl)-4a,5,8,8a-tetrahydro-2Hphthalazin-1-one
TypeSmall organic molecule
Emp. Form.C16H18N2O3
Mol. Mass.286.3257
SMILESCOc1ccc(cc1OC)C1=NNC(=O)[C@@H]2CC=CC[C@H]12