Reaction Details
TargetcAMP-specific 3',5'-cyclic phosphodiesterase 4D
LigandBDBM50304408
Substrate/Competitorn/a
Meas. Tech.ChEMBL_603142 (CHEMBL1041602)
IC50 14.3±n/a nM
Citation Kagayama, KMorimoto, TNagata, SKatoh, FZhang, XInoue, NHashino, AKageyama, KShikaura, JNiwa, T Synthesis and biological evaluation of novel phthalazinone derivatives as topically active phosphodiesterase 4 inhibitors. Bioorg Med Chem17:6959-70 (2009) 
 
cAMP-specific 3',5'-cyclic phosphodiesterase 4D
Name:cAMP-specific 3',5'-cyclic phosphodiesterase 4D
Type:Protein
Mol. Mass.:91092.69
Organism:Homo sapiens (Human)
Description:Q08499
Residue:809
BDBM50304408
NameBDBM50304408
Synonyms:CHEMBL605935 | N-[3-(1H-Imidazol-1-yl)propyl]-2-[cis-4-(3,4-dimethoxyphenyl)-1-oxo-4a,5,8,8a-tetrahydrophthalazin-2(1H)-yl]acetamide
TypeSmall organic molecule
Emp. Form.C24H29N5O4
Mol. Mass.451.5182
SMILESCOc1ccc(cc1OC)C1=NN(CC(=O)NCCCn2ccnc2)C(=O)[C@@H]2CC=CC[C@H]12