Reaction Details
TargetcAMP-specific 3',5'-cyclic phosphodiesterase 4D
LigandBDBM50304409
Substrate/Competitorn/a
Meas. Tech.ChEMBL_603142 (CHEMBL1041602)
IC50 5.2±n/a nM
Citation Kagayama, KMorimoto, TNagata, SKatoh, FZhang, XInoue, NHashino, AKageyama, KShikaura, JNiwa, T Synthesis and biological evaluation of novel phthalazinone derivatives as topically active phosphodiesterase 4 inhibitors. Bioorg Med Chem17:6959-70 (2009) 
 
cAMP-specific 3',5'-cyclic phosphodiesterase 4D
Name:cAMP-specific 3',5'-cyclic phosphodiesterase 4D
Type:Protein
Mol. Mass.:91092.69
Organism:Homo sapiens (Human)
Description:Q08499
Residue:809
BDBM50304409
NameBDBM50304409
Synonyms:CHEMBL595959 | cis-2-{2-[2-(1H-Imidazol-1-yl)ethoxy]ethyl}-4-(3,4-dimethoxyphenyl)-4a,5,8,8a-tetrahydrophthalazin-1(2H)-one
TypeSmall organic molecule
Emp. Form.C23H28N4O4
Mol. Mass.424.4928
SMILESCOc1ccc(cc1OC)C1=NN(CCOCCn2ccnc2)C(=O)[C@@H]2CC=CC[C@H]12