Reaction Details
TargetcAMP-specific 3',5'-cyclic phosphodiesterase 4D
LigandBDBM50304410
Substrate/Competitorn/a
Meas. Tech.ChEMBL_603142 (CHEMBL1041602)
IC50 0.4±n/a nM
Citation Kagayama, KMorimoto, TNagata, SKatoh, FZhang, XInoue, NHashino, AKageyama, KShikaura, JNiwa, T Synthesis and biological evaluation of novel phthalazinone derivatives as topically active phosphodiesterase 4 inhibitors. Bioorg Med Chem17:6959-70 (2009) 
 
cAMP-specific 3',5'-cyclic phosphodiesterase 4D
Name:cAMP-specific 3',5'-cyclic phosphodiesterase 4D
Type:Protein
Mol. Mass.:91092.69
Organism:Homo sapiens (Human)
Description:Q08499
Residue:809
BDBM50304410
NameBDBM50304410
Synonyms:CHEMBL594108 | cis-2-[(E)-4-(1H-Imidazol-1-yl)but-2-enyl]-4-(3,4-dimethoxyphenyl)-4a,5,8,8a-tetrahydrophthalazin-1(2H)-one
TypeSmall organic molecule
Emp. Form.C23H26N4O3
Mol. Mass.406.4775
SMILESCOc1ccc(cc1OC)C1=NN(C\C=C\Cn2ccnc2)C(=O)[C@@H]2CC=CC[C@H]12