Reaction Details
TargetcAMP-specific 3',5'-cyclic phosphodiesterase 4D
LigandBDBM50304413
Substrate/Competitorn/a
Meas. Tech.ChEMBL_603142 (CHEMBL1041602)
IC50 1.3±n/a nM
Citation Kagayama, KMorimoto, TNagata, SKatoh, FZhang, XInoue, NHashino, AKageyama, KShikaura, JNiwa, T Synthesis and biological evaluation of novel phthalazinone derivatives as topically active phosphodiesterase 4 inhibitors. Bioorg Med Chem17:6959-70 (2009) 
 
cAMP-specific 3',5'-cyclic phosphodiesterase 4D
Name:cAMP-specific 3',5'-cyclic phosphodiesterase 4D
Type:Protein
Mol. Mass.:91092.69
Organism:Homo sapiens (Human)
Description:Q08499
Residue:809
BDBM50304413
NameBDBM50304413
Synonyms:CHEMBL596447 | cis-2-[4-(1,4-Dioxa-8-azaspiro[4.5]decan-8-ylmethyl)-benzyl]-4-(3,4-dimethoxyphenyl)-4a,5,8,8a-tetrahydrophthalazin-1(2H)-one
TypeSmall organic molecule
Emp. Form.C31H37N3O5
Mol. Mass.531.6426
SMILESCOc1ccc(cc1OC)C1=NN(Cc2ccc(CN3CCC4(CC3)OCCO4)cc2)C(=O)[C@@H]2CC=CC[C@H]12