Reaction Details
TargetcAMP-specific 3',5'-cyclic phosphodiesterase 4D
LigandBDBM50304420
Substrate/Competitorn/a
Meas. Tech.ChEMBL_603142 (CHEMBL1041602)
IC50 45.9±n/a nM
Citation Kagayama, KMorimoto, TNagata, SKatoh, FZhang, XInoue, NHashino, AKageyama, KShikaura, JNiwa, T Synthesis and biological evaluation of novel phthalazinone derivatives as topically active phosphodiesterase 4 inhibitors. Bioorg Med Chem17:6959-70 (2009) 
 
cAMP-specific 3',5'-cyclic phosphodiesterase 4D
Name:cAMP-specific 3',5'-cyclic phosphodiesterase 4D
Type:Protein
Mol. Mass.:91092.69
Organism:Homo sapiens (Human)
Description:Q08499
Residue:809
BDBM50304420
NameBDBM50304420
Synonyms:6-(3,4-Dimethoxyphenyl)-2-[4-(morpholinomethyl)benzyl]-4,5-dihydropyridazin-3(2H)-one | CHEMBL592942
TypeSmall organic molecule
Emp. Form.C24H29N3O4
Mol. Mass.423.5048
SMILESCOc1ccc(cc1OC)C1=NN(Cc2ccc(CN3CCOCC3)cc2)C(=O)CC1