Reaction Details
TargetcAMP-specific 3',5'-cyclic phosphodiesterase 4D
LigandBDBM50304421
Substrate/Competitorn/a
Meas. Tech.ChEMBL_603142 (CHEMBL1041602)
IC50 16.4±n/a nM
Citation Kagayama, KMorimoto, TNagata, SKatoh, FZhang, XInoue, NHashino, AKageyama, KShikaura, JNiwa, T Synthesis and biological evaluation of novel phthalazinone derivatives as topically active phosphodiesterase 4 inhibitors. Bioorg Med Chem17:6959-70 (2009) 
 
cAMP-specific 3',5'-cyclic phosphodiesterase 4D
Name:cAMP-specific 3',5'-cyclic phosphodiesterase 4D
Type:Protein
Mol. Mass.:91092.69
Organism:Homo sapiens (Human)
Description:Q08499
Residue:809
BDBM50304421
NameBDBM50304421
Synonyms:CHEMBL603194 | cis-5-(3,4-Dimethoxyphenyl)-3-[4-(morpholinomethyl)benzyl]-3,4-diazabicyclo[4.1.0]hept-4-en-2-one
TypeSmall organic molecule
Emp. Form.C25H29N3O4
Mol. Mass.435.5155
SMILESCOc1ccc(cc1OC)C1=NN(Cc2ccc(CN3CCOCC3)cc2)C(=O)[C@@H]2C[C@H]12