Reaction Details
TargetcAMP-specific 3',5'-cyclic phosphodiesterase 4D
LigandBDBM50304423
Substrate/Competitorn/a
Meas. Tech.ChEMBL_603142 (CHEMBL1041602)
IC50 1±n/a nM
Citation Kagayama, KMorimoto, TNagata, SKatoh, FZhang, XInoue, NHashino, AKageyama, KShikaura, JNiwa, T Synthesis and biological evaluation of novel phthalazinone derivatives as topically active phosphodiesterase 4 inhibitors. Bioorg Med Chem17:6959-70 (2009) 
 
cAMP-specific 3',5'-cyclic phosphodiesterase 4D
Name:cAMP-specific 3',5'-cyclic phosphodiesterase 4D
Type:Protein
Mol. Mass.:91092.69
Organism:Homo sapiens (Human)
Description:Q08499
Residue:809
BDBM50304423
NameBDBM50304423
Synonyms:CHEMBL595272 | cis-4-(3,4-Dimethoxyphenyl)-2-[4-(morpholinomethyl)benzyl]-4a,5,6,7,8,8a-hexahydrophthalazin-1(2H)-one
TypeSmall organic molecule
Emp. Form.C28H35N3O4
Mol. Mass.477.5952
SMILESCOc1ccc(cc1OC)C1=NN(Cc2ccccc2CN2CCOCC2)C(=O)[C@@H]2CCCC[C@H]12