Reaction Details
TargetcAMP-specific 3',5'-cyclic phosphodiesterase 4D
LigandBDBM50304417
Substrate/Competitorn/a
Meas. Tech.ChEMBL_603142 (CHEMBL1041602)
IC50 0.3±n/a nM
Citation Kagayama, KMorimoto, TNagata, SKatoh, FZhang, XInoue, NHashino, AKageyama, KShikaura, JNiwa, T Synthesis and biological evaluation of novel phthalazinone derivatives as topically active phosphodiesterase 4 inhibitors. Bioorg Med Chem17:6959-70 (2009) 
 
cAMP-specific 3',5'-cyclic phosphodiesterase 4D
Name:cAMP-specific 3',5'-cyclic phosphodiesterase 4D
Type:Protein
Mol. Mass.:91092.69
Organism:Homo sapiens (Human)
Description:Q08499
Residue:809
BDBM50304417
NameBDBM50304417
Synonyms:CHEMBL593656 cis-(+/-)-4-(3,4-Dimethoxyphenyl)-2-[4-(morpholinomethyl)benzyl]-4a,5,8,8a-tetrahydrophthalazin-1(2H)-one | cis-(-)-4-(3,4-Dimethoxyphenyl)-2-[4-(morpholinomethyl)benzyl]-4a,5,8,8a-tetrahydrophthalazin-1(2H)-one
TypeSmall organic molecule
Emp. Form.C28H33N3O4
Mol. Mass.475.5793
SMILESCOc1ccc(cc1OC)C1=NN(Cc2ccc(CN3CCOCC3)cc2)C(=O)[C@@H]2CC=CC[C@H]12