Reaction Details
TargetEndothelin-1 receptor
LigandBDBM50304495
Substrate/Competitorn/a
Meas. Tech.ChEMBL_603857 (CHEMBL1046474)
Ki 0.36±n/a nM
Citation Höltke, CLaw, MPWagner, SKopka, KFaust, ABreyholz, HJSchober, OBremer, CRiemann, BSchäfers, M PET-compatible endothelin receptor radioligands: synthesis and first in vitro and in vivo studies. Bioorg Med Chem17:7197-208 (2009) 
 
Endothelin-1 receptor
Name:Endothelin-1 receptor
Type:PROTEIN
Mol. Mass.:48591.87
Organism:Mus musculus
Description:ChEMBL_723169
Residue:427
BDBM50304495
NameBDBM50304495
Synonyms:2-{4-[4-(Benzo[1,3]dioxol-5-yl)-2-hydroxy-5-oxo-3-(3,4,5-trimethoxybenzyl)-2,5-dihydro-furan-2-yl]phenoxy}ethyl 4-methylbenzenesulfonate | CHEMBL611626
TypeSmall organic molecule
Emp. Form.C36H34O12S
Mol. Mass.690.713
SMILESCOc1cc(CC2=C(C(=O)OC2(O)c2ccc(OCCOc3ccc(cc3)S(C)(=O)=O)cc2)c2ccc3OCOc3c2)cc(OC)c1OC