Reaction Details
TargetAdenosine receptor A3
LigandBDBM50180197
Substrate/Competitorn/a
Meas. Tech.ChEMBL_604437 (CHEMBL1070693)
Ki 0.38±n/a nM
Citation Choi, WJLee, HWKim, HOChinn, MGao, ZGPatel, AJacobson, KAMoon, HRJung, YHJeong, LS Design and synthesis of N(6)-substituted-4'-thioadenosine-5'-uronamides as potent and selective human A(3) adenosine receptor agonists. Bioorg Med Chem17:8003-11 (2009) 
 
Adenosine receptor A3
Name:Adenosine receptor A3
Type:G Protein-Coupled Receptor (GPCR)
Mol. Mass.:36197.32
Organism:Homo sapiens (Human)
Description:P0DMS8
Residue:318
BDBM50180197
NameBDBM50180197
Synonyms:(2S,3S,4R,5R)-5-(2-chloro-6-(3-iodobenzylamino)-9H-purin-9-yl)-3,4-dihydroxy-N-methyltetrahydrothiophene-2-carboxamide CHEMBL200732
TypeSmall organic molecule
Emp. Form.C18H18ClIN6O3S
Mol. Mass.560.796
SMILESCNC(=O)[C@H]1S[C@H]([C@H](O)[C@@H]1O)n1cnc2c(NCc3cccc(I)c3)nc(Cl)nc12