Reaction Details
TargetAdenosine receptor A3
LigandBDBM50118812
Substrate/Competitorn/a
Meas. Tech.ChEMBL_604437 (CHEMBL1070693)
Ki 1±n/a nM
Citation Choi, WJLee, HWKim, HOChinn, MGao, ZGPatel, AJacobson, KAMoon, HRJung, YHJeong, LS Design and synthesis of N(6)-substituted-4'-thioadenosine-5'-uronamides as potent and selective human A(3) adenosine receptor agonists. Bioorg Med Chem17:8003-11 (2009) 
 
Adenosine receptor A3
Name:Adenosine receptor A3
Type:G Protein-Coupled Receptor (GPCR)
Mol. Mass.:36197.32
Organism:Homo sapiens (Human)
Description:P0DMS8
Residue:318
BDBM50118812
NameBDBM50118812
Synonyms:(2S,3S,4R,5R)-3,4-Dihydroxy-5-[6-(3-iodo-benzylamino)-purin-9-yl]-tetrahydro-furan-2-carboxylic acid methylamide (2S,3S,4R,5R)-5-(6-(3-iodobenzylamino)-9H-purin-9-yl)-3,4-dihydroxy-N-methyl-tetrahydrofuran-2-carboxamide (3S,4R,5R)-3,4-Dihydroxy-5-[6-(3-iodo-benzylamino)-purin-9-yl]-tetrahydro-furan-2-carboxylic acid methylamide 3,4-Dihydroxy-5-[6-(3-iodo-benzylamino)-purin-9-yl]-tetrahydro-furan-2-carboxylic acid methylamide IB-MECA | N6-(3-iodobenzyl)-5'-N-methylcarboxamidoadenosine
TypeSmall organic molecule
Emp. Form.C18H19IN6O4
Mol. Mass.510.2857
SMILESCNC(=O)[C@H]1O[C@H]([C@H](O)[C@@H]1O)n1cnc2c(NCc3cccc(I)c3)ncnc12