Reaction Details
TargetCannabinoid receptor 1
LigandBDBM50304920
Substrate/Competitorn/a
Meas. Tech.ChEMBL_606627 (CHEMBL1071854)
Ki 1700±n/a nM
Citation Sellitto, ILe Bourdonnec, BWorm, KGoodman, ASavolainen, MAChu, GHAjello, CWSaeui, CTLeister, LKCassel, JADehaven, RNLabuda, CJKoblish, MLittle, PJBrogdon, BLSmith, SADolle, RE Novel sulfamoyl benzamides as selective CB(2) agonists with improved in vitro metabolic stability. Bioorg Med Chem Lett20:387-91 (2010) 
 
Cannabinoid receptor 1
Name:Cannabinoid receptor 1
Type:G Protein-Coupled Receptor (GPCR)
Mol. Mass.:52868.96
Organism:Homo sapiens (Human)
Description:P21554
Residue:472
BDBM50304920
NameBDBM50304920
Synonyms:2,2-dimethyl-N-(7-(morpholinosulfonyl)-2,3-dihydro-1H-inden-5-yl)butanamide | CHEMBL603736
TypeSmall organic molecule
Emp. Form.C19H28N2O4S
Mol. Mass.380.502
SMILESCCC(C)(C)C(=O)Nc1cc2CCCc2c(c1)S(=O)(=O)N1CCOCC1