Reaction Details
TargetCannabinoid receptor 2
LigandBDBM50304933
Substrate/Competitorn/a
Meas. Tech.ChEMBL_606628 (CHEMBL1071855)
Ki 90±n/a nM
Citation Sellitto, ILe Bourdonnec, BWorm, KGoodman, ASavolainen, MAChu, GHAjello, CWSaeui, CTLeister, LKCassel, JADehaven, RNLabuda, CJKoblish, MLittle, PJBrogdon, BLSmith, SADolle, RE Novel sulfamoyl benzamides as selective CB(2) agonists with improved in vitro metabolic stability. Bioorg Med Chem Lett20:387-91 (2010) 
 
Cannabinoid receptor 2
Name:Cannabinoid receptor 2
Type:G Protein-Coupled Receptor (GPCR)
Mol. Mass.:39690.94
Organism:Homo sapiens (Human)
Description:P34972
Residue:360
BDBM50304933
NameBDBM50304933
Synonyms:(S)-N-(3-(3-hydroxypyrrolidin-1-ylsulfonyl)-4,5-dimethylphenyl)-2,2-dimethylbutanamide | CHEMBL591795
TypeSmall organic molecule
Emp. Form.C18H28N2O4S
Mol. Mass.368.491
SMILESCCC(C)(C)C(=O)Nc1cc(C)c(C)c(c1)S(=O)(=O)N1CC[C@H](O)C1