Reaction Details
TargetCannabinoid receptor 2
LigandBDBM50304914
Substrate/Competitorn/a
Meas. Tech.ChEMBL_606629 (CHEMBL1071856)
EC50 66±n/a nM
Citation Sellitto, ILe Bourdonnec, BWorm, KGoodman, ASavolainen, MAChu, GHAjello, CWSaeui, CTLeister, LKCassel, JADehaven, RNLabuda, CJKoblish, MLittle, PJBrogdon, BLSmith, SADolle, RE Novel sulfamoyl benzamides as selective CB(2) agonists with improved in vitro metabolic stability. Bioorg Med Chem Lett20:387-91 (2010) 
 
Cannabinoid receptor 2
Name:Cannabinoid receptor 2
Type:Enzyme
Mol. Mass.:39366.68
Organism:Rattus norvegicus (Rat)
Description:Q9QZN9
Residue:360
BDBM50304914
NameBDBM50304914
Synonyms:CHEMBL593166 | N-(3,4-dimethyl-5-(morpholinosulfonyl)phenyl)-2,2,3,3-tetramethylcyclopropanecarboxamide
TypeSmall organic molecule
Emp. Form.C20H30N2O4S
Mol. Mass.394.528
SMILESCc1cc(NC(=O)C2C(C)(C)C2(C)C)cc(c1C)S(=O)(=O)N1CCOCC1