Reaction Details
TargetCannabinoid receptor 2
LigandBDBM50304916
Substrate/Competitorn/a
Meas. Tech.ChEMBL_606629 (CHEMBL1071856)
EC50 11±n/a nM
Citation Sellitto, ILe Bourdonnec, BWorm, KGoodman, ASavolainen, MAChu, GHAjello, CWSaeui, CTLeister, LKCassel, JADehaven, RNLabuda, CJKoblish, MLittle, PJBrogdon, BLSmith, SADolle, RE Novel sulfamoyl benzamides as selective CB(2) agonists with improved in vitro metabolic stability. Bioorg Med Chem Lett20:387-91 (2010) 
 
Cannabinoid receptor 2
Name:Cannabinoid receptor 2
Type:Enzyme
Mol. Mass.:39366.68
Organism:Rattus norvegicus (Rat)
Description:Q9QZN9
Residue:360
BDBM50304916
NameBDBM50304916
Synonyms:CHEMBL593625 | N-(3,4-dimethyl-5-(morpholinosulfonyl)phenyl)-3,3,3-trifluoro-2-methyl-2-(trifluoromethyl)propanamide
TypeSmall organic molecule
Emp. Form.C17H20F6N2O4S
Mol. Mass.462.407
SMILESCc1cc(NC(=O)C(C)(C(F)(F)F)C(F)(F)F)cc(c1C)S(=O)(=O)N1CCOCC1