Reaction Details
TargetSphingosine 1-phosphate receptor 3
LigandBDBM50305383
Substrate/Competitorn/a
Meas. Tech.ChEMBL_603591 (CHEMBL1071143)
EC50>10000±n/a nM
Citation Zécri, FJAlbert, RLandrum, GHinterding, KCooke, NGGuerini, DStreiff, MBruns, CNuesslein-Hildesheim, B Pyrazole derived from (+)-3-carene; a novel potent, selective scaffold for sphingosine-1-phosphate (S1P(1)) receptor agonists. Bioorg Med Chem Lett20:35-7 (2010) 
 
Sphingosine 1-phosphate receptor 3
Name:Sphingosine 1-phosphate receptor 3
Type:G Protein-Coupled Receptor (GPCR)
Mol. Mass.:42278.13
Organism:Homo sapiens (Human)
Description:Q99500
Residue:378
BDBM50305383
NameBDBM50305383
Synonyms:(3bS,4aR)-3,4,4-Trimethyl-1-[(3-phenyl)-allyl]-3b,4,4a,5-tetrahydro-1H-cyclopropa[3,4]cyclopenta[1,2-c]pyrazole | CHEMBL589403
TypeSmall organic molecule
Emp. Form.C19H22N2
Mol. Mass.278.3914
SMILESCc1nn(C\C=C\c2ccccc2)c2C[C@@H]3[C@H](c12)C3(C)C