Reaction Details
TargetSphingosine 1-phosphate receptor 4
LigandBDBM50305376
Substrate/Competitorn/a
Meas. Tech.ChEMBL_603593 (CHEMBL1071145)
EC50>10000±n/a nM
Citation Zécri, FJAlbert, RLandrum, GHinterding, KCooke, NGGuerini, DStreiff, MBruns, CNuesslein-Hildesheim, B Pyrazole derived from (+)-3-carene; a novel potent, selective scaffold for sphingosine-1-phosphate (S1P(1)) receptor agonists. Bioorg Med Chem Lett20:35-7 (2010) 
 
Sphingosine 1-phosphate receptor 4
Name:Sphingosine 1-phosphate receptor 4
Type:G Protein-Coupled Receptor (GPCR)
Mol. Mass.:41647.39
Organism:Homo sapiens (Human)
Description:n/a
Residue:384
BDBM50305376
NameBDBM50305376
Synonyms:3-(3-Trifluoromethyl-phenyl)-1-((3bS,4aR)-3,4,4-trimethyl-3b,4,4a,5-tetrahydro-cyclopropa[3,4]cyclopenta[1,2-c]pyrazol-1-yl)-propenone | CHEMBL590134
TypeSmall organic molecule
Emp. Form.C20H19F3N2O
Mol. Mass.360.3729
SMILESCc1nn(C(=O)\C=C\c2cccc(c2)C(F)(F)F)c2C[C@@H]3[C@H](c12)C3(C)C