Reaction Details
TargetSphingosine 1-phosphate receptor 5
LigandBDBM50305379
Substrate/Competitorn/a
Meas. Tech.ChEMBL_603727 (CHEMBL1039350)
EC50 130±n/a nM
Citation Zécri, FJAlbert, RLandrum, GHinterding, KCooke, NGGuerini, DStreiff, MBruns, CNuesslein-Hildesheim, B Pyrazole derived from (+)-3-carene; a novel potent, selective scaffold for sphingosine-1-phosphate (S1P(1)) receptor agonists. Bioorg Med Chem Lett20:35-7 (2010) 
 
Sphingosine 1-phosphate receptor 5
Name:Sphingosine 1-phosphate receptor 5
Type:G Protein-Coupled Receptor (GPCR)
Mol. Mass.:41796.42
Organism:Homo sapiens (Human)
Description:n/a
Residue:398
BDBM50305379
NameBDBM50305379
Synonyms:3-(Pyridin-4-yl)-1-((3bS,4aR)-3,4,4-trimethyl-3b,4,4a,5-tetrahydro-cyclopropa[3,4]cyclopenta[1,2-c]pyrazol-1-yl)-propenone | CHEMBL590383
TypeSmall organic molecule
Emp. Form.C18H19N3O
Mol. Mass.293.363
SMILESCc1nn(C(=O)\C=C\c2ccncc2)c2C[C@@H]3[C@H](c12)C3(C)C